Reaction Details
TargetReverse transcriptase/RNaseH
LigandBDBM50193523
Substrate/Competitorn/a
Meas. Tech.ChEMBL_385312 (CHEMBL869229)
IC50 49600±n/a nM
Citation Deng, BLHartman, TLBuckheit, RWPannecouque, CDe Clercq, ECushman, M Replacement of the metabolically labile methyl esters in the alkenyldiarylmethane series of non-nucleoside reverse transcriptase inhibitors with isoxazolone, isoxazole, oxazolone, or cyano substituents. J Med Chem49:5316-23 (2006) 
 
Reverse transcriptase/RNaseH
Name:Reverse transcriptase/RNaseH
Type:PROTEIN
Mol. Mass.:65229.15
Organism:Human immunodeficiency virus 1
Description:ChEMBL_1473730
Residue:566
BDBM50193523
NameBDBM50193523
Synonyms:(E)-6-(3-cyanophenyl)-6-(2,3-dihydro-2,7-dimethyl-3-oxobenzo[d]isoxazol-5-yl)hex-5-enoic acid methyl ester | CHEMBL212395
TypeSmall organic molecule
Emp. Form.C23H22N2O4
Mol. Mass.390.4318
SMILESCOC(=O)CCC\C=C(\c1cccc(c1)C#N)c1cc(C)c2on(C)c(=O)c2c1