Reaction Details
TargetReverse transcriptase/RNaseH
LigandBDBM50193527
Substrate/Competitorn/a
Meas. Tech.ChEMBL_385312 (CHEMBL869229)
IC50 9860±n/a nM
Citation Deng, BLHartman, TLBuckheit, RWPannecouque, CDe Clercq, ECushman, M Replacement of the metabolically labile methyl esters in the alkenyldiarylmethane series of non-nucleoside reverse transcriptase inhibitors with isoxazolone, isoxazole, oxazolone, or cyano substituents. J Med Chem49:5316-23 (2006) 
 
Reverse transcriptase/RNaseH
Name:Reverse transcriptase/RNaseH
Type:PROTEIN
Mol. Mass.:65229.15
Organism:Human immunodeficiency virus 1
Description:ChEMBL_1473730
Residue:566
BDBM50193527
NameBDBM50193527
Synonyms:(Z)-5-[1-(2,3-dihydro-2,7-dimethyl-3-oxobenzo[d]isoxazol-5-yl)-4-(2-oxooxazolidin-3-yl)but-1-enyl]-2-methoxy-3-methylbenzoic acid methyl ester | CHEMBL215346
TypeSmall organic molecule
Emp. Form.C26H28N2O7
Mol. Mass.480.5097
SMILESCOC(=O)c1cc(cc(C)c1OC)C(=C/CCN1CCOC1=O)\c1cc(C)c2on(C)c(=O)c2c1