Reaction Details
TargetReverse transcriptase/RNaseH
LigandBDBM50193522
Substrate/Competitorn/a
Meas. Tech.ChEMBL_385312 (CHEMBL869229)
IC50 49200±n/a nM
Citation Deng, BLHartman, TLBuckheit, RWPannecouque, CDe Clercq, ECushman, M Replacement of the metabolically labile methyl esters in the alkenyldiarylmethane series of non-nucleoside reverse transcriptase inhibitors with isoxazolone, isoxazole, oxazolone, or cyano substituents. J Med Chem49:5316-23 (2006) 
 
Reverse transcriptase/RNaseH
Name:Reverse transcriptase/RNaseH
Type:PROTEIN
Mol. Mass.:65229.15
Organism:Human immunodeficiency virus 1
Description:ChEMBL_1473730
Residue:566
BDBM50193522
NameBDBM50193522
Synonyms:CHEMBL214489 | methyl 6-(3,7-dimethyl-2-oxo-2,3-dihydrobenzo[d]oxazol-5-yl)-6-(2,7-dimethyl-3-oxo-2,3-dihydrobenzo[d]isoxazol-5-yl)hex-5-enoate
TypeSmall organic molecule
Emp. Form.C25H26N2O6
Mol. Mass.450.4837
SMILESCOC(=O)CCC\C=C(/c1cc(C)c2oc(=O)n(C)c2c1)c1cc(C)c2on(C)c(=O)c2c1