Reaction Details
TargetReverse transcriptase/RNaseH
LigandBDBM50193552
Substrate/Competitorn/a
Meas. Tech.ChEMBL_386501 (CHEMBL870409)
IC50 8100±n/a nM
Citation García-Aparicio, CBonache, MCDe Meester, ISan-Félix, ABalzarini, JCamarasa, MJVelazquez, S Design and discovery of a novel dipeptidyl-peptidase IV (CD26)-based prodrug approach. J Med Chem49:5339-51 (2006) 
 
Reverse transcriptase/RNaseH
Name:Reverse transcriptase/RNaseH
Type:PROTEIN
Mol. Mass.:65229.15
Organism:Human immunodeficiency virus 1
Description:ChEMBL_1473730
Residue:566
BDBM50193552
NameBDBM50193552
Synonyms:CHEMBL379994 | [1-[2',5'-bis-O-(tert-butyldimethylsilyl)-beta-D-ribofuranosyl]-3-N-[3-N'-[tyrosyl-prolylamino]propyl]thymine]-3'-spiro-5''-[4''-amino-1'',2''-oxathiole-2'',2''-dioxide]
TypeSmall organic molecule
Emp. Form.C41H66N6O11SSi2
Mol. Mass.907.232
SMILESCc1cn(C2OC(CO[Si](C)(C)C(C)(C)C)C3(OS(=O)(=O)C=C3N)C2O[Si](C)(C)C(C)(C)C)c(=O)n(CCCNC(=O)[C@@H]2CCCN2C(=O)[C@@H](N)Cc2ccc(O)cc2)c1=O