Reaction Details
TargetReverse transcriptase/RNaseH
LigandBDBM50193564
Substrate/Competitorn/a
Meas. Tech.ChEMBL_386501 (CHEMBL870409)
IC50 6700±n/a nM
Citation García-Aparicio, CBonache, MCDe Meester, ISan-Félix, ABalzarini, JCamarasa, MJVelazquez, S Design and discovery of a novel dipeptidyl-peptidase IV (CD26)-based prodrug approach. J Med Chem49:5339-51 (2006) 
 
Reverse transcriptase/RNaseH
Name:Reverse transcriptase/RNaseH
Type:PROTEIN
Mol. Mass.:65229.15
Organism:Human immunodeficiency virus 1
Description:ChEMBL_1473730
Residue:566
BDBM50193564
NameBDBM50193564
Synonyms:CHEMBL385844 | [1-[2',5'-bis-O-(tert-butyldimethylsilyl)-beta-D-ribofuranosyl]-3-N-[3-N'-[valylamino]propyl]thymine]-3'-spiro-5''-[4''-amino-1'',2''-oxathiole-2'',2''-dioxide]
TypeSmall organic molecule
Emp. Form.C32H59N5O9SSi2
Mol. Mass.746.075
SMILESCC(C)[C@H](N)C(=O)NCCCn1c(=O)c(C)cn(C2OC(CO[Si](C)(C)C(C)(C)C)C3(OS(=O)(=O)C=C3N)C2O[Si](C)(C)C(C)(C)C)c1=O