Reaction Details
TargetMelanin-concentrating hormone receptor 1
LigandBDBM50193630
Substrate/Competitorn/a
Meas. Tech.ChEMBL_421230 (CHEMBL856552)
IC50 2.3±n/a nM
Citation Jiang, JLin, PHoang, MChang, LTan, CFeighner, SPalyha, OCHreniuk, DLPan, JSailer, AWMorin, NRMacNeil, DJHoward, ADVan der Ploeg, LHGoulet, MTDeVita, RJ 4-Aminoquinoline melanin-concentrating hormone 1-receptor (MCH1R) antagonists. Bioorg Med Chem Lett16:5275-9 (2006) 
 
Melanin-concentrating hormone receptor 1
Name:Melanin-concentrating hormone receptor 1
Type:G Protein-Coupled Receptor (GPCR)
Mol. Mass.:45976.27
Organism:Homo sapiens (Human)
Description:Membranes from CHO-K1 cells stably expressing human MCH1R were used in assays.
Residue:422
BDBM50193630
NameBDBM50193630
Synonyms:(E)-N-(4-amino-2-propylquinolin-6-yl)-3-(4-iodophenyl)acrylamide | CHEMBL216510
TypeSmall organic molecule
Emp. Form.C21H20IN3O
Mol. Mass.457.3075
SMILESCCCc1cc(N)c2cc(NC(=O)\C=C\c3ccc(I)cc3)ccc2n1