Reaction Details
TargetSodium-dependent dopamine transporter
LigandBDBM50193769
Substrate/Competitorn/a
Meas. Tech.ChEMBL_424086 (CHEMBL855089)
Ki 651±n/a nM
Citation Watson, PSJiang, BHarrison, KAsakawa, NWelch, PKCovington, MStowell, NCWadman, EADavies, PSolomon, KANewton, RCTrainor, GLFriedman, SMDecicco, CPKo, SS 2,4-Disubstituted piperidines as selective CC chemokine receptor 3 (CCR3) antagonists: synthesis and selectivity. Bioorg Med Chem Lett16:5695-9 (2006) 
 
Sodium-dependent dopamine transporter
Name:Sodium-dependent dopamine transporter
Type:Multi-pass membrane protein
Mol. Mass.:68497.11
Organism:Homo sapiens (Human)
Description:Q01959
Residue:620
BDBM50193769
NameBDBM50193769
Synonyms:1-(3-((2S,4R)-4-(4-fluorobenzyl)-1-(2-fluoroethyl)piperidin-2-yl)propyl)-3-(3,5-diacetylphenyl)urea | CHEMBL220713
TypeSmall organic molecule
Emp. Form.C28H35F2N3O3
Mol. Mass.499.5926
SMILESCC(=O)c1cc(NC(=O)NCCC[C@H]2C[C@H](Cc3ccc(F)cc3)CCN2CCF)cc(c1)C(C)=O