Reaction Details
TargetSodium-dependent serotonin transporter
LigandBDBM50193768
Substrate/Competitorn/a
Meas. Tech.ChEMBL_424085 (CHEMBL855088)
Ki 42±n/a nM
Citation Watson, PSJiang, BHarrison, KAsakawa, NWelch, PKCovington, MStowell, NCWadman, EADavies, PSolomon, KANewton, RCTrainor, GLFriedman, SMDecicco, CPKo, SS 2,4-Disubstituted piperidines as selective CC chemokine receptor 3 (CCR3) antagonists: synthesis and selectivity. Bioorg Med Chem Lett16:5695-9 (2006) 
 
Sodium-dependent serotonin transporter
Name:Sodium-dependent serotonin transporter
Type:Multi-pass membrane protein
Mol. Mass.:70322.51
Organism:Homo sapiens (Human)
Description:P31645
Residue:630
BDBM50193768
NameBDBM50193768
Synonyms:(+/-)1-(3-acetylphenyl)-3-(3-((2S,4R)-4-benzylpiperidin-2-yl)propyl)urea | CHEMBL218581
TypeSmall organic molecule
Emp. Form.C24H31N3O2
Mol. Mass.393.5218
SMILESCC(=O)c1cccc(NC(=O)NCCC[C@H]2C[C@H](Cc3ccccc3)CCN2)c1