Reaction Details
TargetSodium-dependent dopamine transporter
LigandBDBM50193762
Substrate/Competitorn/a
Meas. Tech.ChEMBL_424086 (CHEMBL855089)
Ki 34±n/a nM
Citation Watson, PSJiang, BHarrison, KAsakawa, NWelch, PKCovington, MStowell, NCWadman, EADavies, PSolomon, KANewton, RCTrainor, GLFriedman, SMDecicco, CPKo, SS 2,4-Disubstituted piperidines as selective CC chemokine receptor 3 (CCR3) antagonists: synthesis and selectivity. Bioorg Med Chem Lett16:5695-9 (2006) 
 
Sodium-dependent dopamine transporter
Name:Sodium-dependent dopamine transporter
Type:Multi-pass membrane protein
Mol. Mass.:68497.11
Organism:Homo sapiens (Human)
Description:Q01959
Residue:620
BDBM50193762
NameBDBM50193762
Synonyms:(+)1-(3-((2S,4R)-4-benzylpiperidin-2-yl)propyl)-3-(3-cyanophenyl)urea (-)1-(3-((2S,4R)-4-benzylpiperidin-2-yl)propyl)-3-(3-cyanophenyl)urea | CHEMBL218997
TypeSmall organic molecule
Emp. Form.C23H28N4O
Mol. Mass.376.4946
SMILESO=C(NCCC[C@H]1C[C@H](Cc2ccccc2)CCN1)Nc1cccc(c1)C#N