Reaction Details
TargetSodium-dependent dopamine transporter
LigandBDBM50193758
Substrate/Competitorn/a
Meas. Tech.ChEMBL_424086 (CHEMBL855089)
Ki 621±n/a nM
Citation Watson, PSJiang, BHarrison, KAsakawa, NWelch, PKCovington, MStowell, NCWadman, EADavies, PSolomon, KANewton, RCTrainor, GLFriedman, SMDecicco, CPKo, SS 2,4-Disubstituted piperidines as selective CC chemokine receptor 3 (CCR3) antagonists: synthesis and selectivity. Bioorg Med Chem Lett16:5695-9 (2006) 
 
Sodium-dependent dopamine transporter
Name:Sodium-dependent dopamine transporter
Type:Multi-pass membrane protein
Mol. Mass.:68497.11
Organism:Homo sapiens (Human)
Description:Q01959
Residue:620
BDBM50193758
NameBDBM50193758
Synonyms:1-(3-((2S,4R)-4-(4-fluorobenzyl)-1-(prop-2-ynyl)piperidin-2-yl)propyl)-3-(3,5-diacetylphenyl)urea | CHEMBL220765
TypeSmall organic molecule
Emp. Form.C29H34FN3O3
Mol. Mass.491.597
SMILESCC(=O)c1cc(NC(=O)NCCC[C@H]2C[C@H](Cc3ccc(F)cc3)CCN2CC#C)cc(c1)C(C)=O