Reaction Details
TargetMelanocortin receptor 5
LigandBDBM50193830
Substrate/Competitorn/a
Meas. Tech.ChEMBL_422338 (CHEMBL908723)
IC50 0.800000±n/a nM
Citation Cain, JPMayorov, AVCai, MWang, HTan, BChandler, KLee, YPetrov, RRTrivedi, DHruby, VJ Design, synthesis, and biological evaluation of a new class of small molecule peptide mimetics targeting the melanocortin receptors. Bioorg Med Chem Lett16:5462-7 (2006) 
 
Melanocortin receptor 5
Name:Melanocortin receptor 5
Type:Enzyme
Mol. Mass.:36612.92
Organism:Homo sapiens (Human)
Description:P33032
Residue:325
BDBM50193830
NameBDBM50193830
Synonyms:1-((3S,8aS)-3-benzyl-hexahydropyrrolo[1,2-a]pyrazin-2(1H)-yl)-3-(1H-indol-3-yl)propan-1-one | CHEMBL387169
TypeSmall organic molecule
Emp. Form.C25H29N3O
Mol. Mass.387.5173
SMILESO=C(CCc1c[nH]c2ccccc12)N1C[C@@H]2CCCN2C[C@@H]1Cc1ccccc1