Reaction Details
TargetMelanocyte-stimulating hormone receptor
LigandBDBM50193836
Substrate/Competitorn/a
Meas. Tech.ChEMBL_422335 (CHEMBL908720)
IC50 1.3±n/a nM
Citation Cain, JPMayorov, AVCai, MWang, HTan, BChandler, KLee, YPetrov, RRTrivedi, DHruby, VJ Design, synthesis, and biological evaluation of a new class of small molecule peptide mimetics targeting the melanocortin receptors. Bioorg Med Chem Lett16:5462-7 (2006) 
 
Melanocyte-stimulating hormone receptor
Name:Melanocyte-stimulating hormone receptor
Type:Enzyme
Mol. Mass.:34717.23
Organism:Homo sapiens (Human)
Description:Q01726
Residue:317
BDBM50193836
NameBDBM50193836
Synonyms:1-((3R,8aS)-3-benzyl-hexahydropyrrolo[1,2-a]pyrazin-2(1H)-yl)-2-phenylethanone | CHEMBL373821
TypeSmall organic molecule
Emp. Form.C22H26N2O
Mol. Mass.334.4546
SMILESO=C(Cc1ccccc1)N1C[C@@H]2CCCN2C[C@H]1Cc1ccccc1