Reaction Details
TargetMelanocortin receptor 5
LigandBDBM50193833
Substrate/Competitorn/a
Meas. Tech.ChEMBL_422338 (CHEMBL908723)
IC50 0.100000±n/a nM
Citation Cain, JPMayorov, AVCai, MWang, HTan, BChandler, KLee, YPetrov, RRTrivedi, DHruby, VJ Design, synthesis, and biological evaluation of a new class of small molecule peptide mimetics targeting the melanocortin receptors. Bioorg Med Chem Lett16:5462-7 (2006) 
 
Melanocortin receptor 5
Name:Melanocortin receptor 5
Type:Enzyme
Mol. Mass.:36612.92
Organism:Homo sapiens (Human)
Description:P33032
Residue:325
BDBM50193833
NameBDBM50193833
Synonyms:CHEMBL220018 | N-[(S)-1-((3S,8aS)-3-benzyl-hexahydro-pyrrolo[1,2-a]pyrazine-2-carbonyl)-4-guanidino-butyl]-3-(1H-indol-3-yl)-propionamide
TypeSmall organic molecule
Emp. Form.C31H41N7O2
Mol. Mass.543.7029
SMILESNC(N)=NCCC[C@H](NC(=O)CCc1c[nH]c2ccccc12)C(=O)N1C[C@@H]2CCCN2C[C@@H]1Cc1ccccc1