Reaction Details
TargetProto-oncogene tyrosine-protein kinase Src
LigandBDBM50193888
Substrate/Competitorn/a
Meas. Tech.ChEMBL_424208 (CHEMBL908982)
IC50>50000±n/a nM
Citation Noronha, GBarrett, KCao, JDneprovskaia, EFine, RGong, XGritzen, CHood, JKang, XKlebansky, BLi, GLiao, WLohse, DMak, CCMcPherson, APalanki, MSPathak, VPRenick, JSoll, RSplittgerber, UWrasidlo, WZeng, BZhao, NZhou, Y Discovery and preliminary structure-activity relationship studies of novel benzotriazine based compounds as Src inhibitors. Bioorg Med Chem Lett16:5546-50 (2006) 
 
Proto-oncogene tyrosine-protein kinase Src
Name:Proto-oncogene tyrosine-protein kinase Src
Type:Protein
Mol. Mass.:59838.60
Organism:Homo sapiens (Human)
Description:P12931
Residue:536
BDBM50193888
NameBDBM50193888
Synonyms:CHEMBL218842 US8481536, 341
TypeSmall organic molecule
Emp. Form.C26H28N4
Mol. Mass.396.5273
SMILESCCCCc1ccc(Nc2nnc3cc(cc(C)c3n2)-c2c(C)cccc2C)cc1