Reaction Details
TargetProto-oncogene tyrosine-protein kinase Src
LigandBDBM50193900
Substrate/Competitorn/a
Meas. Tech.ChEMBL_424208 (CHEMBL908982)
IC50>50000±n/a nM
Citation Noronha, GBarrett, KCao, JDneprovskaia, EFine, RGong, XGritzen, CHood, JKang, XKlebansky, BLi, GLiao, WLohse, DMak, CCMcPherson, APalanki, MSPathak, VPRenick, JSoll, RSplittgerber, UWrasidlo, WZeng, BZhao, NZhou, Y Discovery and preliminary structure-activity relationship studies of novel benzotriazine based compounds as Src inhibitors. Bioorg Med Chem Lett16:5546-50 (2006) 
 
Proto-oncogene tyrosine-protein kinase Src
Name:Proto-oncogene tyrosine-protein kinase Src
Type:Protein
Mol. Mass.:59838.60
Organism:Homo sapiens (Human)
Description:P12931
Residue:536
BDBM50193900
NameBDBM50193900
Synonyms:7-(2,6-dimethylphenyl)-5-methyl-N-(quinolin-8-yl)benzo[e][1,2,4]triazin-3-amine US8481536, 329
TypeSmall organic molecule
Emp. Form.C25H21N5
Mol. Mass.391.4677
SMILESCc1cccc(C)c1-c1cc(C)c2nc(Nc3cccc4cccnc34)nnc2c1