Reaction Details
TargetProto-oncogene tyrosine-protein kinase Src
LigandBDBM50193904
Substrate/Competitorn/a
Meas. Tech.ChEMBL_424208 (CHEMBL908982)
IC50 1500±n/a nM
Citation Noronha, GBarrett, KCao, JDneprovskaia, EFine, RGong, XGritzen, CHood, JKang, XKlebansky, BLi, GLiao, WLohse, DMak, CCMcPherson, APalanki, MSPathak, VPRenick, JSoll, RSplittgerber, UWrasidlo, WZeng, BZhao, NZhou, Y Discovery and preliminary structure-activity relationship studies of novel benzotriazine based compounds as Src inhibitors. Bioorg Med Chem Lett16:5546-50 (2006) 
 
Proto-oncogene tyrosine-protein kinase Src
Name:Proto-oncogene tyrosine-protein kinase Src
Type:Protein
Mol. Mass.:59838.60
Organism:Homo sapiens (Human)
Description:P12931
Residue:536
BDBM50193904
NameBDBM50193904
Synonyms:3-(3-amino-5-methylbenzo[e][1,2,4]triazin-7-yl)-4-chlorophenol | CHEMBL218317
TypeSmall organic molecule
Emp. Form.C14H11ClN4O
Mol. Mass.286.716
SMILESCc1cc(cc2nnc(N)nc12)-c1cc(O)ccc1Cl