Reaction Details
TargetProto-oncogene tyrosine-protein kinase Src
LigandBDBM50193915
Substrate/Competitorn/a
Meas. Tech.ChEMBL_424208 (CHEMBL908982)
IC50 137±n/a nM
Citation Noronha, GBarrett, KCao, JDneprovskaia, EFine, RGong, XGritzen, CHood, JKang, XKlebansky, BLi, GLiao, WLohse, DMak, CCMcPherson, APalanki, MSPathak, VPRenick, JSoll, RSplittgerber, UWrasidlo, WZeng, BZhao, NZhou, Y Discovery and preliminary structure-activity relationship studies of novel benzotriazine based compounds as Src inhibitors. Bioorg Med Chem Lett16:5546-50 (2006) 
 
Proto-oncogene tyrosine-protein kinase Src
Name:Proto-oncogene tyrosine-protein kinase Src
Type:Protein
Mol. Mass.:59838.60
Organism:Homo sapiens (Human)
Description:P12931
Residue:536
BDBM50193915
NameBDBM50193915
Synonyms:7-(2,6-dimethylphenyl)-5-methyl-N-(4-(4-methylpiperazin-1-ylsulfonyl)phenyl)benzo[e][1,2,4]triazin-3-amine US8481536, 415
TypeSmall organic molecule
Emp. Form.C27H30N6O2S
Mol. Mass.502.631
SMILESCN1CCN(CC1)S(=O)(=O)c1ccc(Nc2nnc3cc(cc(C)c3n2)-c2c(C)cccc2C)cc1