Reaction Details
TargetC-X-C chemokine receptor type 1
LigandBDBM50193969
Substrate/Competitorn/a
Meas. Tech.ChEMBL_424262 (CHEMBL908414)
IC50 188±n/a nM
Citation Nie, HWiddowson, KLPalovich, MRFu, WElliott, JDBryan, DLBurman, MSchmidt, DBFoley, JJSarau, HMBusch-Petersen, J N,N'-Diarylcyanoguanidines as antagonists of the CXCR2 and CXCR1 chemokine receptors. Bioorg Med Chem Lett16:5513-6 (2006) 
 
C-X-C chemokine receptor type 1
Name:C-X-C chemokine receptor type 1
Type:Enzyme
Mol. Mass.:39803.83
Organism:Homo sapiens (Human)
Description:P25024
Residue:350
BDBM50193969
NameBDBM50193969
Synonyms:1-(3-{[3-(4-aminopiperidin-1-yl)pentan-3-yl]sulfamoyl}-4-chloro-2-hydroxyphenyl)-3-(2-bromophenyl)-2-cyanoguanidine | CHEMBL386072
TypeSmall organic molecule
Emp. Form.C24H31BrClN7O3S
Mol. Mass.612.97
SMILESCCC(CC)(NS(=O)(=O)c1c(Cl)ccc(N=C(NC#N)Nc2ccccc2Br)c1O)N1CCC(N)CC1