Reaction Details
TargetC-X-C chemokine receptor type 1
LigandBDBM50193972
Substrate/Competitorn/a
Meas. Tech.ChEMBL_424262 (CHEMBL908414)
IC50 104±n/a nM
Citation Nie, HWiddowson, KLPalovich, MRFu, WElliott, JDBryan, DLBurman, MSchmidt, DBFoley, JJSarau, HMBusch-Petersen, J N,N'-Diarylcyanoguanidines as antagonists of the CXCR2 and CXCR1 chemokine receptors. Bioorg Med Chem Lett16:5513-6 (2006) 
 
C-X-C chemokine receptor type 1
Name:C-X-C chemokine receptor type 1
Type:Enzyme
Mol. Mass.:39803.83
Organism:Homo sapiens (Human)
Description:P25024
Residue:350
BDBM50193972
NameBDBM50193972
Synonyms:3-(2-bromophenyl)-2-cyano-1-(2-hydroxy-4-methyl-3-{[3-(morpholin-4-yl)pentan-3-yl]sulfamoyl}phenyl)guanidine | CHEMBL221481
TypeSmall organic molecule
Emp. Form.C24H31BrN6O4S
Mol. Mass.579.51
SMILESCCC(CC)(NS(=O)(=O)c1c(C)ccc(N=C(NC#N)Nc2ccccc2Br)c1O)N1CCOCC1