Reaction Details
TargetC-X-C chemokine receptor type 1
LigandBDBM50193975
Substrate/Competitorn/a
Meas. Tech.ChEMBL_424262 (CHEMBL908414)
IC50 6204±n/a nM
Citation Nie, HWiddowson, KLPalovich, MRFu, WElliott, JDBryan, DLBurman, MSchmidt, DBFoley, JJSarau, HMBusch-Petersen, J N,N'-Diarylcyanoguanidines as antagonists of the CXCR2 and CXCR1 chemokine receptors. Bioorg Med Chem Lett16:5513-6 (2006) 
 
C-X-C chemokine receptor type 1
Name:C-X-C chemokine receptor type 1
Type:Enzyme
Mol. Mass.:39803.83
Organism:Homo sapiens (Human)
Description:P25024
Residue:350
BDBM50193975
NameBDBM50193975
Synonyms:6-chloro-3-{[[(3-chloro-2-fluorophenyl)amino](cyanoimino)methyl]amino}-2-hydroxy-N,N-dimethylbenzenesulfonamide | CHEMBL221039
TypeSmall organic molecule
Emp. Form.C16H14Cl2FN5O3S
Mol. Mass.446.283
SMILESCN(C)S(=O)(=O)c1c(Cl)ccc(N=C(NC#N)Nc2cccc(Cl)c2F)c1O