Reaction Details
TargetC-X-C chemokine receptor type 2
LigandBDBM50193979
Substrate/Competitorn/a
Meas. Tech.ChEMBL_424261 (CHEMBL908413)
IC50 5±n/a nM
Citation Nie, HWiddowson, KLPalovich, MRFu, WElliott, JDBryan, DLBurman, MSchmidt, DBFoley, JJSarau, HMBusch-Petersen, J N,N'-Diarylcyanoguanidines as antagonists of the CXCR2 and CXCR1 chemokine receptors. Bioorg Med Chem Lett16:5513-6 (2006) 
 
C-X-C chemokine receptor type 2
Name:C-X-C chemokine receptor type 2
Type:Protein
Mol. Mass.:40767.88
Organism:Homo sapiens (Human)
Description:P25025
Residue:360
BDBM50193979
NameBDBM50193979
Synonyms:3-{[[(2-bromophenyl)amino](cyanoimino)methyl]amino}-6-chloro-2-hydroxy-N,N-dimethylbenzenesulfonamide | CHEMBL218387
TypeSmall organic molecule
Emp. Form.C16H15BrClN5O3S
Mol. Mass.472.744
SMILESCN(C)S(=O)(=O)c1c(Cl)ccc(N=C(NC#N)Nc2ccccc2Br)c1O