Reaction Details
TargetC-X-C chemokine receptor type 1
LigandBDBM50193971
Substrate/Competitorn/a
Meas. Tech.ChEMBL_424262 (CHEMBL908414)
IC50 100±n/a nM
Citation Nie, HWiddowson, KLPalovich, MRFu, WElliott, JDBryan, DLBurman, MSchmidt, DBFoley, JJSarau, HMBusch-Petersen, J N,N'-Diarylcyanoguanidines as antagonists of the CXCR2 and CXCR1 chemokine receptors. Bioorg Med Chem Lett16:5513-6 (2006) 
 
C-X-C chemokine receptor type 1
Name:C-X-C chemokine receptor type 1
Type:Enzyme
Mol. Mass.:39803.83
Organism:Homo sapiens (Human)
Description:P25024
Residue:350
BDBM50193971
NameBDBM50193971
Synonyms:3-{[[(2-bromophenyl)amino](cyanoimino)methyl]amino}-2-hydroxy-N,N-dimethyl-6-(trifluoromethyl)benzenesulfonamide | CHEMBL218665
TypeSmall organic molecule
Emp. Form.C17H15BrF3N5O3S
Mol. Mass.506.297
SMILESCN(C)S(=O)(=O)c1c(O)c(ccc1C(F)(F)F)N=C(NC#N)Nc1ccccc1Br