Reaction Details
TargetDual specificity mitogen-activated protein kinase kinase 1
LigandBDBM50194033
Substrate/Competitorn/a
Meas. Tech.ChEMBL_420097 (CHEMBL873739)
IC50 57±n/a nM
Citation El Abdellaoui, HVaraprasad, CVBarawkar, DChakravarty, SMaderna, ATam, RChen, HAllan, MWu, JZAppleby, TYan, SZhang, WLang, SYao, NHamatake, RHong, Z Identification of isothiazole-4-carboxamidines derivatives as a novel class of allosteric MEK1 inhibitors. Bioorg Med Chem Lett16:5561-6 (2006) 
 
Dual specificity mitogen-activated protein kinase kinase 1
Name:Dual specificity mitogen-activated protein kinase kinase 1
Type:Other Protein Type
Mol. Mass.:43439.03
Organism:Homo sapiens (Human)
Description:Full-length human MEK-1 was generated by PCR and purified as a fusion protein from Escherichia coli lysates.
Residue:393
BDBM50194033
NameBDBM50194033
Synonyms:5-4-2-chloro-4-fluorophenoxy)-2-methylphenylamino)-3-hydroxy-N-1-hydroxypropan-2-yl)isothiazole-4-carboximidamide | CHEMBL424897
TypeSmall organic molecule
Emp. Form.C20H20ClFN4O3S
Mol. Mass.450.914
SMILESCC(CO)N=C(N)c1c(Nc2ccc(Oc3ccc(F)cc3Cl)cc2C)s[nH]c1=O