Reaction Details
TargetDual specificity mitogen-activated protein kinase kinase 1
LigandBDBM50194064
Substrate/Competitorn/a
Meas. Tech.ChEMBL_420097 (CHEMBL873739)
EC50 70±n/a nM
Citation El Abdellaoui, HVaraprasad, CVBarawkar, DChakravarty, SMaderna, ATam, RChen, HAllan, MWu, JZAppleby, TYan, SZhang, WLang, SYao, NHamatake, RHong, Z Identification of isothiazole-4-carboxamidines derivatives as a novel class of allosteric MEK1 inhibitors. Bioorg Med Chem Lett16:5561-6 (2006) 
 
Dual specificity mitogen-activated protein kinase kinase 1
Name:Dual specificity mitogen-activated protein kinase kinase 1
Type:Other Protein Type
Mol. Mass.:43439.03
Organism:Homo sapiens (Human)
Description:Full-length human MEK-1 was generated by PCR and purified as a fusion protein from Escherichia coli lysates.
Residue:393
BDBM50194064
NameBDBM50194064
Synonyms:5-3-chloro-4-2-chloro-3-trifluoromethyl)phenoxy)phenylamino)-3-hydroxy-N-1-hydroxypropan-2-yl)isothiazole-4-carboximidamide | CHEMBL217126
TypeSmall organic molecule
Emp. Form.C20H17Cl2F3N4O3S
Mol. Mass.521.34
SMILESCC(CO)N=C(N)c1c(Nc2ccc(Oc3cccc(c3Cl)C(F)(F)F)c(Cl)c2)s[nH]c1=O