Reaction Details
TargetDual specificity mitogen-activated protein kinase kinase 1
LigandBDBM50194051
Substrate/Competitorn/a
Meas. Tech.ChEMBL_420098 (CHEMBL873740)
EC50 47±n/a nM
Citation El Abdellaoui, HVaraprasad, CVBarawkar, DChakravarty, SMaderna, ATam, RChen, HAllan, MWu, JZAppleby, TYan, SZhang, WLang, SYao, NHamatake, RHong, Z Identification of isothiazole-4-carboxamidines derivatives as a novel class of allosteric MEK1 inhibitors. Bioorg Med Chem Lett16:5561-6 (2006) 
 
Dual specificity mitogen-activated protein kinase kinase 1
Name:Dual specificity mitogen-activated protein kinase kinase 1
Type:Other Protein Type
Mol. Mass.:43439.03
Organism:Homo sapiens (Human)
Description:Full-length human MEK-1 was generated by PCR and purified as a fusion protein from Escherichia coli lysates.
Residue:393
BDBM50194051
NameBDBM50194051
Synonyms:5-4-2,5-dichlorophenoxy)phenylamino)-3-hydroxy-N-morpholinoisothiazole-4-carboximidamide | CHEMBL214901
TypeSmall organic molecule
Emp. Form.C20H19Cl2N5O3S
Mol. Mass.480.368
SMILESNC(=NN1CCOCC1)c1c(Nc2ccc(Oc3cc(Cl)ccc3Cl)cc2)s[nH]c1=O