Reaction Details
TargetDual specificity mitogen-activated protein kinase kinase 1
LigandBDBM50187821
Substrate/Competitorn/a
Meas. Tech.ChEMBL_420097 (CHEMBL873739)
EC50 8321±n/a nM
Citation El Abdellaoui, HVaraprasad, CVBarawkar, DChakravarty, SMaderna, ATam, RChen, HAllan, MWu, JZAppleby, TYan, SZhang, WLang, SYao, NHamatake, RHong, Z Identification of isothiazole-4-carboxamidines derivatives as a novel class of allosteric MEK1 inhibitors. Bioorg Med Chem Lett16:5561-6 (2006) 
 
Dual specificity mitogen-activated protein kinase kinase 1
Name:Dual specificity mitogen-activated protein kinase kinase 1
Type:Other Protein Type
Mol. Mass.:43439.03
Organism:Homo sapiens (Human)
Description:Full-length human MEK-1 was generated by PCR and purified as a fusion protein from Escherichia coli lysates.
Residue:393
BDBM50187821
NameBDBM50187821
Synonyms:3-hydroxy-5-(4-iodophenylamino)-N-isopropylisothiazole-4-carboxamidine CHEMBL209868
TypeSmall organic molecule
Emp. Form.C13H15IN4OS
Mol. Mass.402.254
SMILESCC(C)NC(=N)c1c(Nc2ccc(I)cc2)s[nH]c1=O