Reaction Details
TargetRibosomal protein S6 kinase beta-1/beta-2
LigandBDBM50196392
Substrate/Competitorn/a
Meas. Tech.ChEMBL_420106 (CHEMBL873748)
IC50 1000±n/a nM
Citation El Abdellaoui, HVaraprasad, CVBarawkar, DChakravarty, SMaderna, ATam, RChen, HAllan, MWu, JZAppleby, TYan, SZhang, WLang, SYao, NHamatake, RHong, Z Identification of isothiazole-4-carboxamidines derivatives as a novel class of allosteric MEK1 inhibitors. Bioorg Med Chem Lett16:5561-6 (2006) 
 
Ribosomal protein S6 kinase beta-1/beta-2
Name:Ribosomal protein S6 kinase beta-1/beta-2
Type:n/a
Mol. Mass.:n/a
Description:ASSAY_ID of EBI is 195569
Components:This complex has 2 components.
Component 1
Name:Ribosomal protein S6 kinase beta-1
Synonyms:70 kDa ribosomal protein S6 kinase 1 70 kDa ribosomal protein kinase (p70S6K) Protein kinase 70S6K (T412E) RPS6KB1 Ribosomal protein S6 kinase I STK14A p70S6K1
Type:Enzyme
Mol. Mass.:59139.89
Organism:Homo sapiens (Human)
Description:His-tagged S6K1.
Residue:525
Component 2
Name:Ribosomal protein S6 kinase beta-2
Synonyms:KS6B2_HUMAN Ribosomal protein S6 kinase (P70S6K) | STK14B
Type:PROTEIN
Mol. Mass.:53460.10
Organism:Homo sapiens (Human)
Description:ChEMBL_306115
Residue:482
Component 3
Name:Ribosomal protein S6 kinase beta-2
Synonyms:KS6B2_HUMAN Ribosomal protein S6 kinase (P70S6K) | STK14B
Type:PROTEIN
Mol. Mass.:53460.10
Organism:Homo sapiens (Human)
Description:ChEMBL_306115
Residue:482
BDBM50196392
NameBDBM50196392
Synonyms:3-hydroxy-N-(2-hydroxy-1-methyl-ethyl)-5-(4-phenylamino-phenylamino)-isothiazole-4-carboxamidine CHEMBL253116
TypeSmall organic molecule
Emp. Form.C19H21N5O2S
Mol. Mass.383.467
SMILESCC(CO)N=C(N)c1c(Nc2ccc(Nc3ccccc3)cc2)s[nH]c1=O