Reaction Details
TargetGlutamate receptor 1
LigandBDBM50194112
Substrate/Competitorn/a
Meas. Tech.ChEMBL_403341 (CHEMBL868048)
Ki 77±n/a nM
Citation Andersen, TFTikhonov, DBBølcho, UBolshakov, KNelson, JKPluteanu, FMellor, IREgebjerg, JStrømgaard, K Uncompetitive antagonism of AMPA receptors: Mechanistic insights from studies of polyamine toxin derivatives. J Med Chem49:5414-23 (2006) 
 
Glutamate receptor 1
Name:Glutamate receptor 1
Type:Protein
Mol. Mass.:101583.91
Organism:Rattus norvegicus (Rat)
Description:P19490
Residue:907
BDBM50194112
NameBDBM50194112
Synonyms:(S)-N-(1-(5-(12-aminododecylamino)pentylamino)-3-(4-hydroxyphenyl)-1-oxopropan-2-yl)butyramide | CHEMBL213090
TypeSmall organic molecule
Emp. Form.C30H54N4O3
Mol. Mass.518.7748
SMILESCCCC(=O)N[C@@H](Cc1ccc(O)cc1)C(=O)NCCCCCNCCCCCCCCCCCCN