Reaction Details
TargetGlutamate receptor 1
LigandBDBM50194127
Substrate/Competitorn/a
Meas. Tech.ChEMBL_403339 (CHEMBL869260)
Ki 110±n/a nM
Citation Andersen, TFTikhonov, DBBølcho, UBolshakov, KNelson, JKPluteanu, FMellor, IREgebjerg, JStrømgaard, K Uncompetitive antagonism of AMPA receptors: Mechanistic insights from studies of polyamine toxin derivatives. J Med Chem49:5414-23 (2006) 
 
Glutamate receptor 1
Name:Glutamate receptor 1
Type:Protein
Mol. Mass.:101583.91
Organism:Rattus norvegicus (Rat)
Description:P19490
Residue:907
BDBM50194127
NameBDBM50194127
Synonyms:(S)-N-(1-(5-(7-aminoheptylamino)pentylamino)-3-(4-hydroxyphenyl)-1-oxopropan-2-yl)butyramide | CHEMBL214170
TypeSmall organic molecule
Emp. Form.C25H44N4O3
Mol. Mass.448.6419
SMILESCCCC(=O)N[C@@H](Cc1ccc(O)cc1)C(=O)NCCCCCNCCCCCCCN