Reaction Details
TargetCarboxylic ester hydrolase
LigandBDBM10469
Substrate/Competitorn/a
Meas. Tech.ChEMBL_403197 (CHEMBL869257)
IC50 155±n/a nM
Citation Rydberg, EHBrumshtein, BGreenblatt, HMWong, DMShaya, DWilliams, LDCarlier, PRPang, YPSilman, ISussman, JL Complexes of alkylene-linked tacrine dimers with Torpedo californica acetylcholinesterase: Binding of Bis5-tacrine produces a dramatic rearrangement in the active-site gorge. J Med Chem49:5491-500 (2006) 
 
Carboxylic ester hydrolase
Name:Carboxylic ester hydrolase
Type:Enzyme
Mol. Mass.:67776.22
Organism:Rattus norvegicus (rat)
Description:n/a
Residue:597
BDBM10469
NameBDBM10469
Synonyms:Bis-THA inhibitor 1c CHEMBL424707 | N-[9-(1,2,3,4-tetrahydroacridin-9-ylamino)nonyl]-1,2,3,4-tetrahydroacridin-9-amine
TypeSmall organic molecule
Emp. Form.C35H44N4
Mol. Mass.520.7507
SMILESC(CCCCNc1c2CCCCc2nc2ccccc12)CCCCNc1c2CCCCc2nc2ccccc12