Reaction Details
TargetCarboxylic ester hydrolase
LigandBDBM9047
Substrate/Competitorn/a
Meas. Tech.ChEMBL_403197 (CHEMBL869257)
IC50 119±n/a nM
Citation Rydberg, EHBrumshtein, BGreenblatt, HMWong, DMShaya, DWilliams, LDCarlier, PRPang, YPSilman, ISussman, JL Complexes of alkylene-linked tacrine dimers with Torpedo californica acetylcholinesterase: Binding of Bis5-tacrine produces a dramatic rearrangement in the active-site gorge. J Med Chem49:5491-500 (2006) 
 
Carboxylic ester hydrolase
Name:Carboxylic ester hydrolase
Type:Enzyme
Mol. Mass.:67776.22
Organism:Rattus norvegicus (rat)
Description:n/a
Residue:597
BDBM9047
NameBDBM9047
Synonyms:Bis-THA inhibitor 5 Hexylene-Linked Bis-tacrine N-[6-(1,2,3,4-tetrahydroacridin-9-ylamino)hexyl]-1,2,3,4-tetrahydroacridin-9-amine
TypeSmall organic molecule
Emp. Form.C32H38N4
Mol. Mass.478.6709
SMILESC(CCCNc1c2CCCCc2nc2ccccc12)CCNc1c2CCCCc2nc2ccccc12