Reaction Details
TargetAcetylcholinesterase
LigandBDBM10479
Substrate/Competitorn/a
Meas. Tech.ChEMBL_403196 (CHEMBL869256)
IC50 254±n/a nM
Citation Rydberg, EHBrumshtein, BGreenblatt, HMWong, DMShaya, DWilliams, LDCarlier, PRPang, YPSilman, ISussman, JL Complexes of alkylene-linked tacrine dimers with Torpedo californica acetylcholinesterase: Binding of Bis5-tacrine produces a dramatic rearrangement in the active-site gorge. J Med Chem49:5491-500 (2006) 
 
Acetylcholinesterase
Name:Acetylcholinesterase
Type:Enzyme
Mol. Mass.:68193.62
Organism:Rattus norvegicus (rat)
Description:P37136
Residue:614
BDBM10479
NameBDBM10479
Synonyms:A3A.2HCl CHEMBL378006 | N-[3-(1,2,3,4-tetrahydroacridin-9-ylamino)propyl]-1,2,3,4-tetrahydroacridin-9-amine dihydrochloride
TypeSmall organic molecule
Emp. Form.C29H32N4
Mol. Mass.436.5912
SMILESC(CNc1c2CCCCc2nc2ccccc12)CNc1c2CCCCc2nc2ccccc12