Reaction Details
TargetHistamine H4 receptor
LigandBDBM50194208
Substrate/Competitorn/a
Meas. Tech.ChEMBL_393881 (CHEMBL854651)
EC50>10000±n/a nM
Citation Watanabe, MKazuta, YHayashi, HYamada, SMatsuda, AShuto, S Stereochemical diversity-oriented conformational restriction strategy. Development of potent histamine H3 and/or H4 receptor antagonists with an imidazolylcyclopropane structure. J Med Chem49:5587-96 (2006) 
 
Histamine H4 receptor
Name:Histamine H4 receptor
Type:G Protein-Coupled Receptor (GPCR)
Mol. Mass.:44517.02
Organism:Homo sapiens (Human)
Description:Binding assays were using CHO cells stably expressing hH4R receptors.
Residue:390
BDBM50194208
NameBDBM50194208
Synonyms:(1S,2R)-trans-2-[2-(4-chlorobenzylamino)ethyl]-1-(1H-imidazol-4-yl)cyclopropane | CHEMBL214311
TypeSmall organic molecule
Emp. Form.C15H18ClN3
Mol. Mass.275.777
SMILESClc1ccc(CNCC[C@H]2C[C@@H]2c2cnc[nH]2)cc1