Reaction Details
TargetHistamine H3 receptor
LigandBDBM22914
Substrate/Competitorn/a
Meas. Tech.ChEMBL_393884 (CHEMBL854655)
IC50 16±n/a nM
Citation Watanabe, MKazuta, YHayashi, HYamada, SMatsuda, AShuto, S Stereochemical diversity-oriented conformational restriction strategy. Development of potent histamine H3 and/or H4 receptor antagonists with an imidazolylcyclopropane structure. J Med Chem49:5587-96 (2006) 
 
Histamine H3 receptor
Name:Histamine H3 receptor
Type:G Protein-Coupled Receptor (GPCR)
Mol. Mass.:48691.47
Organism:Homo sapiens (Human)
Description:Binding assays were using CHO cells stably expressing hH3R receptors.
Residue:445
BDBM22914
NameBDBM22914
Synonyms:CHEMBL260374 Thioperamide | US11622967, Compound Thioperamide
TypeSmall organic molecule
Emp. Form.C15H24N4S
Mol. Mass.292.443
SMILESS=C(NC1CCCCC1)N1CCC(CC1)c1cnc[nH]1