Reaction Details
TargetHistamine H4 receptor
LigandBDBM50194211
Substrate/Competitorn/a
Meas. Tech.ChEMBL_393875 (CHEMBL912691)
Ki 177±n/a nM
Citation Watanabe, MKazuta, YHayashi, HYamada, SMatsuda, AShuto, S Stereochemical diversity-oriented conformational restriction strategy. Development of potent histamine H3 and/or H4 receptor antagonists with an imidazolylcyclopropane structure. J Med Chem49:5587-96 (2006) 
 
Histamine H4 receptor
Name:Histamine H4 receptor
Type:G Protein-Coupled Receptor (GPCR)
Mol. Mass.:44517.02
Organism:Homo sapiens (Human)
Description:Binding assays were using CHO cells stably expressing hH4R receptors.
Residue:390
BDBM50194211
NameBDBM50194211
Synonyms:(1S,2S)-cis-2-[2-(cyclohexylmethylamino)ethyl]-1-(1H-imidazol-4-yl)cyclopropane | CHEMBL213133
TypeSmall organic molecule
Emp. Form.C15H25N3
Mol. Mass.247.3791
SMILESC(C[C@@H]1C[C@@H]1c1cnc[nH]1)NCC1CCCCC1