Reaction Details
TargetHistamine H2 receptor
LigandBDBM7966
Substrate/Competitorn/a
Meas. Tech.ChEMBL_393879 (CHEMBL854649)
EC50 650±n/a nM
Citation Watanabe, MKazuta, YHayashi, HYamada, SMatsuda, AShuto, S Stereochemical diversity-oriented conformational restriction strategy. Development of potent histamine H3 and/or H4 receptor antagonists with an imidazolylcyclopropane structure. J Med Chem49:5587-96 (2006) 
 
Histamine H2 receptor
Name:Histamine H2 receptor
Type:G Protein-Coupled Receptor (GPCR)
Mol. Mass.:40115.31
Organism:Homo sapiens (Human)
Description:n/a
Residue:359
BDBM7966
NameBDBM7966
Synonyms:2-(1H-imidazol-4-yl)ethan-1-amine CHEMBL90 Ergotidine Histamine Peremin | [3H]histamine
TypeSmall organic molecule
Emp. Form.C5H9N3
Mol. Mass.111.1451
SMILESNCCc1cnc[nH]1