Reaction Details
TargetHistamine H3 receptor
LigandBDBM50194215
Substrate/Competitorn/a
Meas. Tech.ChEMBL_393873 (CHEMBL912689)
Ki>1000±n/a nM
Citation Watanabe, MKazuta, YHayashi, HYamada, SMatsuda, AShuto, S Stereochemical diversity-oriented conformational restriction strategy. Development of potent histamine H3 and/or H4 receptor antagonists with an imidazolylcyclopropane structure. J Med Chem49:5587-96 (2006) 
 
Histamine H3 receptor
Name:Histamine H3 receptor
Type:G Protein-Coupled Receptor (GPCR)
Mol. Mass.:48691.47
Organism:Homo sapiens (Human)
Description:Binding assays were using CHO cells stably expressing hH3R receptors.
Residue:445
BDBM50194215
NameBDBM50194215
Synonyms:(1R,2S)-cis-2-(4-chlorobenzylamino)methyl-1-(1H-imidazol-4-yl)cyclopropane | CHEMBL378511
TypeSmall organic molecule
Emp. Form.C14H16ClN3
Mol. Mass.261.75
SMILESClc1ccc(CNC[C@H]2C[C@H]2c2cnc[nH]2)cc1