Reaction Details
TargetHistamine H1 receptor
LigandBDBM50194202
Substrate/Competitorn/a
Meas. Tech.ChEMBL_393878 (CHEMBL854648)
EC50>10000±n/a nM
Citation Watanabe, MKazuta, YHayashi, HYamada, SMatsuda, AShuto, S Stereochemical diversity-oriented conformational restriction strategy. Development of potent histamine H3 and/or H4 receptor antagonists with an imidazolylcyclopropane structure. J Med Chem49:5587-96 (2006) 
 
Histamine H1 receptor
Name:Histamine H1 receptor
Type:G Protein-Coupled Receptor (GPCR)
Mol. Mass.:55808.72
Organism:Homo sapiens (Human)
Description:Cell pellets from SK-N-MC cells transfected with human H1 receptor were used in binding assay.
Residue:487
BDBM50194202
NameBDBM50194202
Synonyms:(1S,2R)-trans-2-[2-(cyclohexylmethylamino)ethyl]-1-(1H-imidazol-4-yl)cyclopropane | CHEMBL214312
TypeSmall organic molecule
Emp. Form.C15H25N3
Mol. Mass.247.3791
SMILESC(C[C@H]1C[C@@H]1c1cnc[nH]1)NCC1CCCCC1