Reaction Details
TargetCollagenase 3
LigandBDBM50194285
Substrate/Competitorn/a
Meas. Tech.ChEMBL_424283 (CHEMBL908435)
IC50 0.63±n/a nM
Citation Reiter, LAFreeman-Cook, KDJones, CSMartinelli, GJAntipas, ASBerliner, MADatta, KDowns, JTEskra, JDForman, MDGreer, EMGuzman, RHardink, JRJanat, FKeene, NFLaird, ERLiras, JLLopresti-Morrow, LLMitchell, PGPandit, JRobertson, DSperger, DVaughn-Bowser, MLWaller, DMYocum, SA Potent, selective pyrimidinetrione-based inhibitors of MMP-13. Bioorg Med Chem Lett16:5822-6 (2006) 
 
Collagenase 3
Name:Collagenase 3
Type:Enzyme
Mol. Mass.:53808.06
Organism:Homo sapiens (Human)
Description:P45452
Residue:471
BDBM50194285
NameBDBM50194285
Synonyms:3-(2-(4-(4-(5-(2-methoxyethyl)-2,4,6-trioxo-hexahydropyrimidin-5-yloxy)phenoxy)phenyl)oxazol-4-yl)benzonitrile | CHEMBL374770
TypeSmall organic molecule
Emp. Form.C29H22N4O7
Mol. Mass.538.5076
SMILESCOCCC1(Oc2ccc(Oc3ccc(cc3)-c3nc(co3)-c3cccc(c3)C#N)cc2)C(=O)NC(=O)NC1=O