Reaction Details
TargetCollagenase 3
LigandBDBM50194290
Substrate/Competitorn/a
Meas. Tech.ChEMBL_424283 (CHEMBL908435)
IC50 0.57±n/a nM
Citation Reiter, LAFreeman-Cook, KDJones, CSMartinelli, GJAntipas, ASBerliner, MADatta, KDowns, JTEskra, JDForman, MDGreer, EMGuzman, RHardink, JRJanat, FKeene, NFLaird, ERLiras, JLLopresti-Morrow, LLMitchell, PGPandit, JRobertson, DSperger, DVaughn-Bowser, MLWaller, DMYocum, SA Potent, selective pyrimidinetrione-based inhibitors of MMP-13. Bioorg Med Chem Lett16:5822-6 (2006) 
 
Collagenase 3
Name:Collagenase 3
Type:Enzyme
Mol. Mass.:53808.06
Organism:Homo sapiens (Human)
Description:P45452
Residue:471
BDBM50194290
NameBDBM50194290
Synonyms:5-(4-(4-(4-(4-fluorophenyl)oxazol-2-yl)phenoxy)phenoxy)-5-(2-methoxyethyl)pyrimidine-2,4,6(1H,3H,5H)-trione | CHEMBL386954
TypeSmall organic molecule
Emp. Form.C28H22FN3O7
Mol. Mass.531.4886
SMILESCOCCC1(Oc2ccc(Oc3ccc(cc3)-c3nc(co3)-c3ccc(F)cc3)cc2)C(=O)NC(=O)NC1=O