Reaction Details
TargetCollagenase 3
LigandBDBM50194294
Substrate/Competitorn/a
Meas. Tech.ChEMBL_424283 (CHEMBL908435)
IC50 0.85±n/a nM
Citation Reiter, LAFreeman-Cook, KDJones, CSMartinelli, GJAntipas, ASBerliner, MADatta, KDowns, JTEskra, JDForman, MDGreer, EMGuzman, RHardink, JRJanat, FKeene, NFLaird, ERLiras, JLLopresti-Morrow, LLMitchell, PGPandit, JRobertson, DSperger, DVaughn-Bowser, MLWaller, DMYocum, SA Potent, selective pyrimidinetrione-based inhibitors of MMP-13. Bioorg Med Chem Lett16:5822-6 (2006) 
 
Collagenase 3
Name:Collagenase 3
Type:Enzyme
Mol. Mass.:53808.06
Organism:Homo sapiens (Human)
Description:P45452
Residue:471
BDBM50194294
NameBDBM50194294
Synonyms:CHEMBL221806 | N-(3-fluorobenzyl)-4-(4-(5-(2-ethoxyethyl)-2,4,6-trioxo-hexahydropyrimidin-5-yloxy)phenoxy)benzamide
TypeSmall organic molecule
Emp. Form.C28H26FN3O7
Mol. Mass.535.5203
SMILESCCOCCC1(Oc2ccc(Oc3ccc(cc3)C(=O)NCc3cccc(F)c3)cc2)C(=O)NC(=O)NC1=O