Reaction Details
TargetCollagenase 3
LigandBDBM50194297
Substrate/Competitorn/a
Meas. Tech.ChEMBL_424283 (CHEMBL908435)
IC50 0.54±n/a nM
Citation Reiter, LAFreeman-Cook, KDJones, CSMartinelli, GJAntipas, ASBerliner, MADatta, KDowns, JTEskra, JDForman, MDGreer, EMGuzman, RHardink, JRJanat, FKeene, NFLaird, ERLiras, JLLopresti-Morrow, LLMitchell, PGPandit, JRobertson, DSperger, DVaughn-Bowser, MLWaller, DMYocum, SA Potent, selective pyrimidinetrione-based inhibitors of MMP-13. Bioorg Med Chem Lett16:5822-6 (2006) 
 
Collagenase 3
Name:Collagenase 3
Type:Enzyme
Mol. Mass.:53808.06
Organism:Homo sapiens (Human)
Description:P45452
Residue:471
BDBM50194297
NameBDBM50194297
Synonyms:5-(2-ethoxyethyl)-5-(4-(4-(3-(pyridin-4-yl)-1,2,4-oxadiazol-5-yl)phenoxy)phenoxy)pyrimidine-2,4,6(1H,3H,5H)-trione | CHEMBL374015
TypeSmall organic molecule
Emp. Form.C27H23N5O7
Mol. Mass.529.5008
SMILESCCOCCC1(Oc2ccc(Oc3ccc(cc3)-c3nc(no3)-c3ccncc3)cc2)C(=O)NC(=O)NC1=O