Reaction Details
TargetCollagenase 3
LigandBDBM50194311
Substrate/Competitorn/a
Meas. Tech.ChEMBL_424283 (CHEMBL908435)
IC50 0.84±n/a nM
Citation Reiter, LAFreeman-Cook, KDJones, CSMartinelli, GJAntipas, ASBerliner, MADatta, KDowns, JTEskra, JDForman, MDGreer, EMGuzman, RHardink, JRJanat, FKeene, NFLaird, ERLiras, JLLopresti-Morrow, LLMitchell, PGPandit, JRobertson, DSperger, DVaughn-Bowser, MLWaller, DMYocum, SA Potent, selective pyrimidinetrione-based inhibitors of MMP-13. Bioorg Med Chem Lett16:5822-6 (2006) 
 
Collagenase 3
Name:Collagenase 3
Type:Enzyme
Mol. Mass.:53808.06
Organism:Homo sapiens (Human)
Description:P45452
Residue:471
BDBM50194311
NameBDBM50194311
Synonyms:4-(4-(5-(2-ethoxyethyl)-2,4,6-trioxo-hexahydropyrimidin-5-yloxy)phenoxy)-N-phenylbenzamide | CHEMBL375667
TypeSmall organic molecule
Emp. Form.C27H25N3O7
Mol. Mass.503.5033
SMILESCCOCCC1(Oc2ccc(Oc3ccc(cc3)C(=O)Nc3ccccc3)cc2)C(=O)NC(=O)NC1=O