Reaction Details
TargetKappa-type opioid receptor
LigandBDBM50194392
Substrate/Competitorn/a
Meas. Tech.ChEMBL_424357 (CHEMBL909560)
Ki>1000±n/a nM
Citation Lee, DYHe, MLiu-Chen, LYWang, YLi, JGXu, WMa, ZCarlezon, WACohen, B Synthesis and in vitro pharmacological studies of new C(4)-modified salvinorin A analogues. Bioorg Med Chem Lett16:5498-502 (2006) 
 
Kappa-type opioid receptor
Name:Kappa-type opioid receptor
Type:G Protein-Coupled Receptor (GPCR)
Mol. Mass.:42648.76
Organism:Homo sapiens (Human)
Description:P41145
Residue:380
BDBM50194392
NameBDBM50194392
Synonyms:(2S,4aR,6aS,7R,9S,10aS,10bR)-7-(1-(2-cyanoethyl)-1H-tetrazol-5-yl)-2-(furan-3-yl)-6a,10b-dimethyl-4,10-dioxo-dodecahydro-1H-benzo[f]isochromen-9-yl acetate | CHEMBL376868
TypeSmall organic molecule
Emp. Form.C25H29N5O6
Mol. Mass.495.5277
SMILESCC(=O)O[C@H]1C[C@@H](c2nnnn2CCC#N)[C@]2(C)CC[C@H]3C(=O)O[C@@H](C[C@]3(C)[C@H]2C1=O)c1ccoc1