Reaction Details
TargetKappa-type opioid receptor
LigandBDBM50171151
Substrate/Competitorn/a
Meas. Tech.ChEMBL_424358 (CHEMBL909561)
EC50 74.1±n/a nM
Citation Lee, DYHe, MLiu-Chen, LYWang, YLi, JGXu, WMa, ZCarlezon, WACohen, B Synthesis and in vitro pharmacological studies of new C(4)-modified salvinorin A analogues. Bioorg Med Chem Lett16:5498-502 (2006) 
 
Kappa-type opioid receptor
Name:Kappa-type opioid receptor
Type:G Protein-Coupled Receptor (GPCR)
Mol. Mass.:42648.76
Organism:Homo sapiens (Human)
Description:P41145
Residue:380
BDBM50171151
NameBDBM50171151
Synonyms:(2S,4aS,6aR,7R,9S,10aS,10bR)-9-acetoxy-2-(furan-3-yl)-6a,10b-dimethyl-4,10-dioxo-dodecahydro-1H-benzo[f]isochromene-7-carboxylic acid CHEMBL197037
TypeSmall organic molecule
Emp. Form.C22H26O8
Mol. Mass.418.437
SMILESCC(=O)O[C@H]1C[C@@H](C(O)=O)[C@]2(C)CC[C@@H]3C(=O)O[C@@H](C[C@]3(C)[C@H]2C1=O)c1ccoc1