Reaction Details
TargetDelta-type opioid receptor
LigandBDBM50194487
Substrate/Competitorn/a
Meas. Tech.ChEMBL_424404 (CHEMBL911335)
Ki 31.9±n/a nM
Citation Shiotani, KLi, TMiyazaki, ATsuda, YBryant, SDAmbo, ASasaki, YLazarus, LHOkada, Y Synthesis of 3,6-bis[H-Tyr/H-Dmt-NH(CH2)m,n]-2(1H)pyrazinone derivatives: function of alkyl chain length on opioid activity. Bioorg Med Chem Lett16:5793-6 (2006) 
 
Delta-type opioid receptor
Name:Delta-type opioid receptor
Type:G Protein-Coupled Receptor (GPCR)
Mol. Mass.:40465.04
Organism:Rattus norvegicus (rat)
Description:Competition binding assays were using CHO-K1 cell membranes expressing the opioid receptor.
Residue:372
BDBM50194487
NameBDBM50194487
Synonyms:3-[4'-(H-Dmt)-aminobutyl]-6-[3'-(H-Dmt)-aminopropyl]-5-methyl-2(1H)-pyrazinone | CHEMBL376061
TypeSmall organic molecule
Emp. Form.C34H48N6O5
Mol. Mass.620.7821
SMILESCc1cc(O)cc(C)c1C[C@H](N)C(=O)NCCCCc1nc(C)c(CCCNC(=O)[C@@H](N)Cc2c(C)cc(O)cc2C)[nH]c1=O