Reaction Details
TargetMuscarinic acetylcholine receptor M3
LigandBDBM50194646
Substrate/Competitorn/a
Meas. Tech.ChEMBL_395698 (CHEMBL909206)
Ki 2.4±n/a nM
Citation Sagara, YSagara, TUchiyama, MOtsuki, SKimura, TFujikawa, TNoguchi, KOhtake, N Identification of a novel 4-aminomethylpiperidine class of M3 muscarinic receptor antagonists and structural insight into their M3 selectivity. J Med Chem49:5653-63 (2006) 
 
Muscarinic acetylcholine receptor M3
Name:Muscarinic acetylcholine receptor M3
Type:Enzyme
Mol. Mass.:66151.03
Organism:Homo sapiens (Human)
Description:P20309
Residue:590
BDBM50194646
NameBDBM50194646
Synonyms:(2R)-1-((2S,4R)-4-hydroxy-1-[3,3,3-tris(4-fluorophenyl)propanoyl]pyrrolidine-2-yl)carbonyl-N-[1-(2-propyl)-4-piperidinylmethyl]pyrrolidine-2-carboxamide | CHEMBL212141
TypeSmall organic molecule
Emp. Form.C34H36F3N3O4
Mol. Mass.607.6625
SMILESCC(C)NC(=O)[C@H]1CCCN1C(=O)[C@@H]1C[C@@H](O)CN1C(=O)CC(c1ccc(F)cc1)(c1ccc(F)cc1)c1ccc(F)cc1