Reaction Details
TargetMuscarinic acetylcholine receptor M3
LigandBDBM50194653
Substrate/Competitorn/a
Meas. Tech.ChEMBL_395698 (CHEMBL909206)
Ki 48±n/a nM
Citation Sagara, YSagara, TUchiyama, MOtsuki, SKimura, TFujikawa, TNoguchi, KOhtake, N Identification of a novel 4-aminomethylpiperidine class of M3 muscarinic receptor antagonists and structural insight into their M3 selectivity. J Med Chem49:5653-63 (2006) 
 
Muscarinic acetylcholine receptor M3
Name:Muscarinic acetylcholine receptor M3
Type:Enzyme
Mol. Mass.:66151.03
Organism:Homo sapiens (Human)
Description:P20309
Residue:590
BDBM50194653
NameBDBM50194653
Synonyms:(R)-N-((1S,2S)-2-aminocyclohexyl)-1-((S)-1-(3,3,3-triphenylpropanoyl)pyrrolidine-2-carbonyl)pyrrolidine-2-carboxamide trifluoroacetic acid | CHEMBL405117
TypeSmall organic molecule
Emp. Form.C37H44N4O3
Mol. Mass.592.7703
SMILESN[C@H]1CCCC[C@@H]1NC(=O)[C@H]1CCCN1C(=O)[C@@H]1CCCN1C(=O)CC(c1ccccc1)(c1ccccc1)c1ccccc1