Reaction Details
TargetMuscarinic acetylcholine receptor M2
LigandBDBM50194639
Substrate/Competitorn/a
Meas. Tech.ChEMBL_395700 (CHEMBL909208)
Ki 68±n/a nM
Citation Sagara, YSagara, TUchiyama, MOtsuki, SKimura, TFujikawa, TNoguchi, KOhtake, N Identification of a novel 4-aminomethylpiperidine class of M3 muscarinic receptor antagonists and structural insight into their M3 selectivity. J Med Chem49:5653-63 (2006) 
 
Muscarinic acetylcholine receptor M2
Name:Muscarinic acetylcholine receptor M2
Type:GPCR
Mol. Mass.:51730.61
Organism:Homo sapiens (Human)
Description:P08172
Residue:466
BDBM50194639
NameBDBM50194639
Synonyms:(2R)-N-(1-cyclobutylmethyl-4-piperidinylmethyl)-1-((2S,4R)-4-hydroxy-1-[3,3,3-tris(4-fluorophenyl)propanoyl]pyrrolidine-2-yl)carbonylpyrrolidine-2-carboxamide | CHEMBL215189
TypeSmall organic molecule
Emp. Form.C42H49F3N4O4
Mol. Mass.730.8581
SMILESO[C@@H]1C[C@H](N(C1)C(=O)CC(c1ccc(F)cc1)(c1ccc(F)cc1)c1ccc(F)cc1)C(=O)N1CCC[C@@H]1C(=O)NCC1CCN(CC2CCC2)CC1