Reaction Details
TargetMuscarinic acetylcholine receptor M3
LigandBDBM50194655
Substrate/Competitorn/a
Meas. Tech.ChEMBL_395698 (CHEMBL909206)
Ki 0.51±n/a nM
Citation Sagara, YSagara, TUchiyama, MOtsuki, SKimura, TFujikawa, TNoguchi, KOhtake, N Identification of a novel 4-aminomethylpiperidine class of M3 muscarinic receptor antagonists and structural insight into their M3 selectivity. J Med Chem49:5653-63 (2006) 
 
Muscarinic acetylcholine receptor M3
Name:Muscarinic acetylcholine receptor M3
Type:Enzyme
Mol. Mass.:66151.03
Organism:Homo sapiens (Human)
Description:P20309
Residue:590
BDBM50194655
NameBDBM50194655
Synonyms:(2R)-N-(1-cyclopentyl-4-piperidinylmethyl)-1-((2S,4R)-4-hydroxy-1-[3,3,3-tris(4-fluorophenyl)-propanoyl]pyrrolidine-2-yl)carbonylpyrrolidine-2-carboxamide | CHEMBL212645
TypeSmall organic molecule
Emp. Form.C42H49F3N4O4
Mol. Mass.730.8581
SMILESO[C@@H]1C[C@H](N(C1)C(=O)CC(c1ccc(F)cc1)(c1ccc(F)cc1)c1ccc(F)cc1)C(=O)N1CCC[C@@H]1C(=O)NCC1CCN(CC1)C1CCCC1